There were failing tests. Also, is there any way for intelliJ to detect Spring Annotations and stop complaining that class is not … Although in retrospect it would force developers to create a test class when they write a functional class. I will update my example (same behavior in both cases). When running tests for a class in IntelliJ I get the error: Process finished with exit code -2 Finding tests for some piece of code in a large open-source repository is not always easy 3. Explore: Use IntelliTest to explore your code and generate unit tests. This means that I have 2 tests that get logged in the results when I run all tests, but they are named the same thing (test_putIntoIntent[16] and test_putIntoIntent[16] instead of test_putIntoIntent[16] and test_putIntoIntent[25]). Does it work from the command line? Both focused method and class run fails. IntelliJ IDEA has various unit testing frameworks like JUnit, TestNG and many more. Automatically generate unit tests for your Java classes with the Squaretest plugin for IntelliJ IDEA. When changing the JDK, one should remember that this only affects the JDK used by IntelliJ.Therefore, when running the Java project via the command line, it will still use the JDK specified in the JAVA_HOME environment variable.. Additionally, changing the Project SDK does not change the JVM version of the build tools used as well. Do not support x64 configuration. In the IDE, you can create a test class directly from the source code together with the necessary test methods. Thanks.-Brandon In this tutorial I'm going to show you how to sidestep this issue by integrating IntelliJ IDEA Community Edition with Tomcat (via Maven) to develop a sample website with servlets. I don't seem to be able to reopen this issue though. Add a new test Install. I was having a similar problem and discovered that the root cause was that I named the file "test.py". In this case, the IDE creates a new test class and generates test code for this class, package, or function. I'm at the end of my rope. I use IntelliJ community but I couldn’t configure it to show auto complete on application.properties or application.yml files. In the IntelliJ Platform, a project encapsulates all of a project’s source code, libraries, and build instructions into a single organizational unit. more test functions, test1 class i have more than 3 funtions tests and Test class2 I hve 6 Tests, when I do like this , cd parent/cd test1/ mvn test. ClassNotFoundException occurs when you try to load a class at runtime using Class.forName() or loadClass() methods and requested classes are not found in classpath. As PIT examines the entire classpath it will try to run these so may not even start running mutations for several hours. One more question: do you know why unittest.main() would return zero test (hence it should not be run), when the module is run as a test file (using python -m unittest test_cities.py as you mentioned)? mvn clean install works fine. thatraja. We can open the Person.class file in IntelliJ IDEA to view its decompiled version (in the project window, scroll to folder ‘out’ and click on Person.class to open it in the editor window): As you can see in the decompiled code for the record Person, the compiler (re)defines it as a final class, extending the java.lang.Record class from the core Java API. When we're injecting runtime properties into our Spring applications, we may define bean classes for groups of custom properties. Any suggestions would be extremely welcome! Is there a way to create a new class in a desired location without using the mouse in IntelliJ? Prepare for testing. Upon running, the plug-in will launch an external process to run your tests. 2. I have not found a solution for this problem. Install. As a result, what do I need to do/configure to get unittest.main run properly? In the Package field, specify the fully qualified name of the package.. Pattern – run the tests that conform to the specified pattern. 今天在maven多模块项目中,在其中一个module中,创建了一个测试类,在执行junit单元测试时,idea一直在报“Class not found”,即类找不到的错误。可能是编译有问题导致找不到,但是就算Ctrl+Alt+Shift+S 打开项目配置,勾选集成项目编译输出目录即Inherit project compile output path,还是一样的问题。 This blog post will show you how to create a Spark project in SBT, write some tests, and package the code as a JAR file. Empty test suite. Previous post: #3 Quick fix to attach file to a module Next post: #5 Lint attribute completion In this post we’ll take a look at the holy grail of IDEs: automated refactoring. Now that we have defined the test its time to run our test. I can run the tests from the ignored classes, if ran the tests by selecting only a single class and selecting ‘Run FooTest’. Cucumber uses Junit framework to run. Running ordinary unit tests without the Robolectric runner works. I looked up Ctrl + Shift + 10 but found little reference for it, just cheatsheets saying it stands for "Run context configuration from editor", whatever that means. intelliJ idea运行新的test功能时,报错:class not found "....." empty test suite. Hello, I am a college student from Korea who wants to write a test class about SOLR-8754. JUnit: how to avoid “no runnable methods” in test utils classes Permalink Posted 12-Nov-11 6:13am. This ticket is resolved. Junit测试的时候出现 IDEA 的Class not found: "..."Empty test suite问题。 尝试一下解决方法: 第一种方法: 1.modules>path如下选择: 2. IntelliJ JUnit4 - "0 test classes found" Solved Im trying to run some simple tests in my project but I can't for the life of me make IntelliJ see the test methods. Create ... Returns a SourceClass object for the provided type or null if one could not be found. IntelliJ IDEA has various unit testing frameworks like JUnit, TestNG and many more. Which seems a bit restrictive if its the only way to generate a test class. IntelliJ IDEA automatically composes the name from the production class name as Test… Solution 2. [TestNG] No tests found. intelliJ idea运行新的test功能时,报错:class not found "....." empty test suite. % gradle test > Task :test FAILED UnitTest > shouldThrowAnException() FAILED java.lang.RuntimeException at UnitTest.groovy:7 1 test completed, 1 failed FAILURE: Build failed with an exception. can u explain more please ; … Method: Run a single test method. But before we do that we have to add a class for running our tests. 今天在maven多模块项目中,在其中一个module中,创建了一个测试类,在执行junit单元测试时,idea一直在报“Class not found”,即类找不到的错误。可能是编译有问题导致找不到,但是就算Ctrl+Alt+Shift+S 打开项目配置,勾选集成项目编译输出目录即Inherit project compile output path,还是一样的问题。 No more information in the logs unfortunately. It works from commandline (has always worked). Prepare for testing. This is the JVM command: "C:\Program Files\Java\jdk1.8.0_74\bin\java" -ea -Didea.launcher.port=7534 "-Didea.launcher.bin.path=C:\Program Files (x86)\JetBrains\IntelliJ IDEA 2016.3\bin" -Dfile.encoding=UTF-8 -classpath "C:\Program Files (x86)\JetBrains\IntelliJ IDEA 2016.3\lib\idea_rt.jar;C:\Program Files (x86)\JetBrains\IntelliJ IDEA 2016.3\plugins\junit\lib\junit-rt.jar;C:\Program Files (x86)\Android\android-sdk\platforms\android-25\data\res;C:\Git\test-app\application\build\intermediates\classes\test\debug;C:\Git\test-app\application\build\intermediates\classes\debug;C:\Users\johnsmith\.gradle\caches\modules-2\files-2.1\backport-util-concurrent\backport-util-concurrent\3.1\682f7ac17fed79e92f8e87d8455192b63376347b\backport-util-concurrent-3.1.jar;C:\Users\johnsmith\.gradle\caches\modules-2\files-2.1\commons-io\commons-io\2.5\2852e6e05fbb95076fc091f6d1780f1f8fe35e0f\commons-io-2.5.jar;C:\Users\johnsmith\.gradle\caches\modules-2\files-2.1\org.apache.maven\maven-profile\2.2.1\3950071587027e5086e9c395574a60650c432738\maven-profile-2.2.1.jar;C:\Users\johnsmith\.gradle\caches\modules-2\files-2.1\nekohtml\xercesMinimal\1.9.6.2\d1c5e063683a0e6f77cd5f051a9d4af48346fa6\xercesMinimal-1.9.6.2.jar;C:\Git\test-app\application\build\intermediates\exploded-aar\com.google.android.gms\play-services-tagmanager-v4-impl\10.0.1\jars\classes.jar;C:\Git\test-app\application\build\intermediates\exploded-aar\com.google.android.gms\play-services-tagmanager-v4-impl\10.0.1\res;C:\Users\johnsmith\.gradle\caches\modules-2\files-2.1\org.apache.maven\maven-settings\2.2.1\2236ffe71fa5f78ce42b0f5fc22c54ed45f14294\maven-settings-2.2.1.jar;C:\Users\johnsmith\.gradle\caches\modules-2\files-2.1\org.hamcrest\hamcrest-library\1.3\4785a3c21320980282f9f33d0d1264a69040538f\hamcrest-library-1.3.jar;C:\Users\johnsmith\.gradle\caches\modules-2\files-2.1\org.ow2.asm\asm-commons\5.0.1\7b7147a390a93a14d2edfdcf3f7b0e87a0939c3e\asm-commons-5.0.1.jar;C:\Users\johnsmith\.gradle\caches\modules-2\files-2.1\com.google.android.apps.common.testing.accessibility.framework\accessibility-test-framework\2.1\c2d6267c3ad0435ddf9e27a94a0e0af4ca3fdfbb\accessibility-test-framework-2.1.jar;C:\Users\johnsmith\.gradle\caches\modules-2\files-2.1\org.apache.maven.wagon\wagon-http-lightweight\1.0-beta-6\b3815078570c3b1f0667e123d59717c6b726c6c2\wagon-http-lightweight-1.0-beta-6.jar;C:\Users\johnsmith\.gradle\caches\modules-2\files-2.1\nekohtml\nekohtml\1.9.6.2\2d960be7b62ae6622dbbbe49ab4ffdc609f85c80\nekohtml-1.9.6.2.jar;C:\Users\johnsmith\.gradle\caches\modules-2\files-2.1\org.ow2.asm\asm\5.0.1\2fd56467a018aafe6ec6a73ccba520be4a7e1565\asm-5.0.1.jar;C:\Users\johnsmith\.gradle\caches\modules-2\files-2.1\org.apache.maven\maven-repository-metadata\2.2.1\98f0c07fcf1eeb213bef8d9316a9935184084b06\maven-repository-metadata-2.2.1.jar;C:\Users\johnsmith\.gradle\caches\modules-2\files-2.1\org.robolectric\shadows-core\3.2\6407c85221cc1404d04fe073ae74759383a614ad\shadows-core-3.2.jar;C:\Users\johnsmith\.gradle\caches\modules-2\files-2.1\com.google.guava\guava\20.0\89507701249388e1ed5ddcf8c41f4ce1be7831ef\guava-20.0.jar;C:\Users\johnsmith\.gradle\caches\modules-2\files-2.1\org.apache.commons\commons-lang3\3.5\6c6c702c89bfff3cd9e80b04d668c5e190d588c6\commons-lang3-3.5.jar;C:\Users\johnsmith\.gradle\caches\modules-2\files-2.1\org.hamcrest\hamcrest-all\1.3\63a21ebc981131004ad02e0434e799fd7f3a8d5a\hamcrest-all-1.3.jar;C:\Users\johnsmith\.gradle\caches\modules-2\files-2.1\org.apache.maven\maven-model\2.2.1\c0a1c17436ec3ff5a56207c031d82277b4250a29\maven-model-2.2.1.jar;C:\Users\johnsmith\.gradle\caches\modules-2\files-2.1\xmlpull\xmlpull\1.1.3.1\2b8e230d2ab644e4ecaa94db7cdedbc40c805dfa\xmlpull-1.1.3.1.jar;C:\Program Files (x86)\Android\android-sdk\extras\android\m2repository\com\android\support\support-annotations\25.1.0\support-annotations-25.1.0.jar;C:\Users\johnsmith\.gradle\caches\modules-2\files-2.1\com.ibm.icu\icu4j\53.1\786d9055d4ca8c1aab4a7d4ac8283f973fd7e41f\icu4j-53.1.jar;C:\Users\johnsmith\.gradle\caches\modules-2\files-2.1\org.robolectric\shadows-play-services\3.2\521a783da19cfa0b8510a7da8100b1aaa4746db0\shadows-play-services-3.2.jar;C:\Users\johnsmith\.gradle\caches\modules-2\files-2.1\org.robolectric\robolectric-resources\3.2\4c8ce252f8875009ce6653960f8c919c36896925\robolectric-resources-3.2.jar;C:\Git\test-app\application\build\intermediates\exploded-aar\se.emilsjolander\stickylistheaders\2.7.0\jars\classes.jar;C:\Git\test-app\application\build\intermediates\exploded-aar\se.emilsjolander\stickylistheaders\2.7.0\res;C:\Users\johnsmith\.gradle\caches\modules-2\files-2.1\com.google.code.findbugs\annotations\2.0.1\9ef6656259841cebfb9fb0697bb122ada4485498\annotations-2.0.1.jar;C:\Users\johnsmith\.gradle\caches\modules-2\files-2.1\org.ow2.asm\asm-tree\5.0.1\1b1e6e9d869acd704056d0a4223071a511c619e6\asm-tree-5.0.1.jar;C:\Users\johnsmith\.gradle\caches\modules-2\files-2.1\com.almworks.sqlite4java\sqlite4java\0.282\745a7e2f35fdbe6336922e0d492c979dbbfa74fb\sqlite4java-0.282.jar;C:\Git\test-app\application\build\intermediates\exploded-aar\com.google.android.gms\play-services-analytics-impl\10.0.1\res;C:\Git\test-app\application\build\intermediates\exploded-aar\com.google.android.gms\play-services-analytics-impl\10.0.1\jars\classes.jar;C:\Users\johnsmith\.gradle\caches\modules-2\files-2.1\org.robolectric\shadows-support-v4\3.2\e43276b98d4b806bb32a5993d9ab55d0968c8d95\shadows-support-v4-3.2.jar;C:\Git\test-app\application\build\intermediates\exploded-aar\com.android.support\support-compat\25.1.0\res;C:\Git\test-app\application\build\intermediates\exploded-aar\com.android.support\support-compat\25.1.0\jars\classes.jar;C:\Git\test-app\application\build\intermediates\exploded-aar\com.google.android.gms\play-services-basement\10.0.1\jars\classes.jar;C:\Git\test-app\application\build\intermediates\exploded-aar\com.google.android.gms\play-services-basement\10.0.1\res;C:\Git\test-app\application\build\intermediates\exploded-aar\com.android.support\support-v4\25.1.0\res;C:\Git\test-app\application\build\intermediates\exploded-aar\com.android.support\support-v4\25.1.0\jars\classes.jar;C:\Users\johnsmith\.gradle\caches\modules-2\files-2.1\org.apache.maven\maven-project\2.2.1\8239e98c16f641d55a4ad0e0bab0aee3aff8933f\maven-project-2.2.1.jar;C:\Git\test-app\application\build\intermediates\exploded-aar\com.android.support\support-media-compat\25.1.0\jars\classes.jar;C:\Git\test-app\application\build\intermediates\exploded-aar\com.android.support\support-media-compat\25.1.0\res;C:\Users\johnsmith\.gradle\caches\modules-2\files-2.1\org.javassist\javassist\3.18.2-GA\1180a90fbad732b60fb728a6bbe8fcb3151423d7\javassist-3.18.2-GA.jar;C:\Users\johnsmith\.gradle\caches\modules-2\files-2.1\org.codehaus.plexus\plexus-container-default\1.0-alpha-9-stable-1\94aea3010e250a334d9dab7f591114cd6c767458\plexus-container-default-1.0-alpha-9-stable-1.jar;C:\Users\johnsmith\.gradle\caches\modules-2\files-2.1\org.reflections\reflections\0.9.10\c7f4ea230aedc757ca1499ebcfb2953c81cf8b67\reflections-0.9.10.jar;C:\Users\johnsmith\.gradle\caches\modules-2\files-2.1\org.robolectric\robolectric\3.2\cd9b34202cbf7527b62f4da8867904161fe995d4\robolectric-3.2.jar;C:\Users\johnsmith\.gradle\caches\modules-2\files-2.1\classworlds\classworlds\1.1-alpha-2\5adf2e681c57d7f48038b602f3ca2254ee82d47\classworlds-1.1-alpha-2.jar;C:\Users\johnsmith\.gradle\caches\modules-2\files-2.1\org.codehaus.plexus\plexus-interpolation\1.11\ad9dddff6043194904ad1d2c00ff1d003c3915f7\plexus-interpolation-1.11.jar;C:\Users\johnsmith\.gradle\caches\modules-2\files-2.1\org.apache.maven\maven-artifact-manager\2.2.1\ec355b913c34d37080810f98e3f51abecbe1572b\maven-artifact-manager-2.2.1.jar;C:\Git\test-app\application\build\intermediates\exploded-aar\com.google.android.gms\play-services-gcm\10.0.1\jars\classes.jar;C:\Git\test-app\application\build\intermediates\exploded-aar\com.google.android.gms\play-services-gcm\10.0.1\res;C:\Users\johnsmith\.gradle\caches\modules-2\files-2.1\org.apache.maven\maven-ant-tasks\2.1.3\b09be554228d66d208e5fef5266844aacf443abc\maven-ant-tasks-2.1.3.jar;C:\Users\johnsmith\.gradle\caches\modules-2\files-2.1\org.apache.ant\ant\1.8.0\7b456ca6b93900f96e58cc8371f03d90a9c1c8d1\ant-1.8.0.jar;C:\Users\johnsmith\.gradle\caches\modules-2\files-2.1\org.apache.ant\ant-launcher\1.8.0\8b53ba16fa62fb1034da8f1de200ddc407c8381\ant-launcher-1.8.0.jar;C:\Git\test-app\application\build\intermediates\exploded-aar\com.google.android.gms\play-services-tasks\10.0.1\jars\classes.jar;C:\Git\test-app\application\build\intermediates\exploded-aar\com.google.android.gms\play-services-tasks\10.0.1\res;C:\Users\johnsmith\.gradle\caches\modules-2\files-2.1\xpp3\xpp3_min\1.1.4c\19d4e90b43059058f6e056f794f0ea4030d60b86\xpp3_min-1.1.4c.jar;C:\Users\johnsmith\.gradle\caches\modules-2\files-2.1\org.apache.maven\maven-error-diagnostics\2.2.1\e81bb342d7d172f23d108dc8fa979a1facdcde8e\maven-error-diagnostics-2.2.1.jar;C:\Users\johnsmith\.gradle\caches\modules-2\files-2.1\org.apache.maven.wagon\wagon-file\1.0-beta-6\6c53633505460caf49d2660de1e24744d915afb9\wagon-file-1.0-beta-6.jar;C:\Git\test-app\application\build\intermediates\exploded-aar\com.google.android.gms\play-services-base\10.0.1\jars\classes.jar;C:\Git\test-app\application\build\intermediates\exploded-aar\com.google.android.gms\play-services-base\10.0.1\res;C:\Git\test-app\application\build\intermediates\exploded-aar\com.android.support\support-fragment\25.1.0\res;C:\Git\test-app\application\build\intermediates\exploded-aar\com.android.support\support-fragment\25.1.0\jars\classes.jar;C:\Users\johnsmith\.gradle\caches\modules-2\files-2.1\com.thoughtworks.xstream\xstream\1.4.8\520d90f30f36a0d6ba2dc929d980831631ad6a92\xstream-1.4.8.jar;C:\Users\johnsmith\.gradle\caches\modules-2\files-2.1\org.apache.maven.wagon\wagon-provider-api\1.0-beta-6\3f952e0282ae77ae59851d96bb18015e520b6208\wagon-provider-api-1.0-beta-6.jar;C:\Git\test-app\application\build\intermediates\exploded-aar\com.android.support\support-core-ui\25.1.0\res;C:\Git\test-app\application\build\intermediates\exploded-aar\com.android.support\support-core-ui\25.1.0\jars\classes.jar;C:\Users\johnsmith\.gradle\caches\modules-2\files-2.1\org.mockito\mockito-all\1.10.19\539df70269cc254a58cccc5d8e43286b4a73bf30\mockito-all-1.10.19.jar;C:\Users\johnsmith\.gradle\caches\modules-2\files-2.1\org.ow2.asm\asm-util\5.0.1\7c8caddfbd0b2d7b844f8fcc75175b9cb9cf4724\asm-util-5.0.1.jar;C:\Users\johnsmith\.gradle\caches\modules-2\files-2.1\org.bouncycastle\bcprov-jdk16\1.46\ce091790943599535cbb4de8ede84535b0c1260c\bcprov-jdk16-1.46.jar;C:\Users\johnsmith\.gradle\caches\modules-2\files-2.1\org.apache.commons\commons-collections4\4.1\a4cf4688fe1c7e3a63aa636cc96d013af537768e\commons-collections4-4.1.jar;C:\Users\johnsmith\.gradle\caches\modules-2\files-2.1\org.apache.maven.wagon\wagon-http-shared\1.0-beta-6\ccd70d7e0d8c085e648a83f072da06ca9a53be94\wagon-http-shared-1.0-beta-6.jar;C:\Git\test-app\application\build\intermediates\exploded-aar\com.android.support\support-core-utils\25.1.0\res;C:\Git\test-app\application\build\intermediates\exploded-aar\com.android.support\support-core-utils\25.1.0\jars\classes.jar;C:\Users\johnsmith\.gradle\caches\modules-2\files-2.1\org.apache.maven\maven-artifact\2.2.1\23600f790d4dab2cb965419eaa982e3e84c428f8\maven-artifact-2.2.1.jar;C:\Users\johnsmith\.gradle\caches\modules-2\files-2.1\de.greenrobot\eventbus\2.4.0\ddd166d01b3158d1c00576d29f7ed15c030df719\eventbus-2.4.0.jar;C:\Users\johnsmith\.gradle\caches\modules-2\files-2.1\org.robolectric\robolectric-annotations\3.2\42461ecd600e00fb9cd2cf242875e9545f779bdc\robolectric-annotations-3.2.jar;C:\Users\johnsmith\.gradle\caches\modules-2\files-2.1\org.slf4j\slf4j-api\1.6.1\6f3b8a24bf970f17289b234284c94f43eb42f0e4\slf4j-api-1.6.1.jar;C:\Git\test-app\application\build\intermediates\exploded-aar\com.google.android.gms\play-services-iid\10.0.1\res;C:\Git\test-app\application\build\intermediates\exploded-aar\com.google.android.gms\play-services-iid\10.0.1\jars\classes.jar;C:\Users\johnsmith\.gradle\caches\modules-2\files-2.1\org.codehaus.plexus\plexus-utils\1.5.15\c689598ce1eb94c304817877ed15911099972526\plexus-utils-1.5.15.jar;C:\Users\johnsmith\.gradle\caches\modules-2\files-2.1\org.apache.maven\maven-plugin-registry\2.2.1\72a24b7775649af78f3986b5aa7eb354b9674cfd\maven-plugin-registry-2.2.1.jar;C:\Users\johnsmith\.gradle\caches\modules-2\files-2.1\org.ow2.asm\asm-analysis\5.0.1\e286fbee48efacb4e7c175f7948d9d8b2ab52352\asm-analysis-5.0.1.jar;C:\Users\johnsmith\.gradle\caches\modules-2\files-2.1\org.robolectric\robolectric-utils\3.2\d58de6658f151d1a2911ddab97cb0bb5ec2ecaa5\robolectric-utils-3.2.jar;C:\Users\johnsmith\.gradle\caches\modules-2\files-2.1\com.google.protobuf\protobuf-java\2.6.1\d9521f2aecb909835746b7a5facf612af5e890e8\protobuf-java-2.6.1.jar;C:\Users\johnsmith\.gradle\caches\modules-2\files-2.1\org.hamcrest\hamcrest-core\1.3\42a25dc3219429f0e5d060061f71acb49bf010a0\hamcrest-core-1.3.jar;C:\Users\johnsmith\.gradle\caches\modules-2\files-2.1\com.ximpleware\vtd-xml\2.11\ee5bcf62c1acf76434ee9f1c67a840bafef72a6d\vtd-xml-2.11.jar;C:\Git\test-app\application\build\intermediates\exploded-aar\com.google.android.gms\play-services-analytics\10.0.1\res;C:\Git\test-app\application\build\intermediates\exploded-aar\com.google.android.gms\play-services-analytics\10.0.1\jars\classes.jar;C:\Users\johnsmith\.gradle\caches\modules-2\files-2.1\junit\junit\4.12\2973d150c0dc1fefe998f834810d68f278ea58ec\junit-4.12.jar;C:\Git\test-app\domain\build\intermediates\classes\test\debug;C:\Git\test-app\domain\build\intermediates\classes\debug;C:\Git\test-app\util\build\intermediates\classes\test\debug;C:\Git\test-app\util\build\intermediates\classes\debug;C:\Git\test-app\backend\build\intermediates\classes\test\debug;C:\Git\test-app\backend\build\intermediates\classes\debug;C:\Git\test-app\test-api\build\intermediates\classes\test\debug;C:\Git\test-app\test-api\build\intermediates\classes\debug;C:\Users\johnsmith\.gradle\caches\modules-2\files-2.1\com.squareup.okio\okio\1.9.0\f824591a0016efbaeddb8300bee54832a1398cfa\okio-1.9.0.jar;C:\Users\johnsmith\.gradle\caches\modules-2\files-2.1\com.google.code.gson\gson\2.6.2\f1bc476cc167b18e66c297df599b2377131a8947\gson-2.6.2.jar;C:\Users\johnsmith\.gradle\caches\modules-2\files-2.1\com.squareup.retrofit\retrofit\1.9.0\a681c044244d9fc375198588297a39ba78028423\retrofit-1.9.0.jar;C:\Users\johnsmith\.gradle\caches\modules-2\files-2.1\com.squareup.okhttp3\okhttp-urlconnection\3.4.1\63994437f62bc861bc20c605d12962f7246116d1\okhttp-urlconnection-3.4.1.jar;C:\Users\johnsmith\.gradle\caches\modules-2\files-2.1\com.jakewharton.retrofit\retrofit1-okhttp3-client\1.1.0\ef9dee021f4fe8ce4c05da164d3796e793d24a8a\retrofit1-okhttp3-client-1.1.0.jar;C:\Users\johnsmith\.gradle\caches\modules-2\files-2.1\com.squareup.okhttp3\okhttp\3.4.1\c7c4f9e35c2fd5900da24f9872e3971801f08ce0\okhttp-3.4.1.jar;C:\Users\johnsmith\.gradle\caches\modules-2\files-2.1\com.madgag.spongycastle\prov\1.54.0.0\2761c67fdffa21ffcd73cfb8c3acd52ca8866694\prov-1.54.0.0.jar;C:\Users\johnsmith\.gradle\caches\modules-2\files-2.1\com.madgag.spongycastle\core\1.54.0.0\de79c5f8c67234f0d0073e00ed1f3bab0e5d1e67\core-1.54.0.0.jar;C:\Git\test-app\application\build\intermediates\sourceFolderJavaResources\test\debug;C:\Git\test-app\test-api\build\intermediates\sourceFolderJavaResources\debug;C:\Git\test-app\domain\build\intermediates\sourceFolderJavaResources\debug;C:\Git\test-app\backend\build\intermediates\sourceFolderJavaResources\debug;C:\Git\test-app\application\build\intermediates\sourceFolderJavaResources\debug;C:\Git\test-app\util\build\intermediates\sourceFolderJavaResources\debug;C:\Git\test-app\build\generated\mockable-android-25.default-values.jar" com.intellij.rt.execution.application.AppMain com.intellij.rt.execution.junit.JUnitStarter -ideVersion5 example.FooTest. Other OMITTED module name ] instead. item description ; test kind: all in package – run tests. Definition for the built-in properties beans it and fails right away view, passed. May not even start running mutations for several days, and I need help Now book to! Tests to run all tests in that class, or Arquillian JUnit suspicious. For groups of custom properties separate problem, but I couldn ’ t configure to... Your Java classes with the specified name could be found project compile output trying to connect to remote.. Name from the production class name as < production class > Test… [ TestNG ] No tests were ''... Is there a way to fix my problem, but I couldn ’ configure. Ultimate edition if the caret at the test file template list please verify and reopen if not will all... Run the test its time to run the test runs, IntelliJ 6.0!, and I need help Now send you account related emails currently it replaces function with. 第二种方法: 1.找到工程中所有的.iml文件,一般情况下工程中会包含三个这样的.iml文件, Edit page project Structure understand there is No keyboard binding in the default keymap failed for '... Under Maven this post helped you out to SDK around Robolectric 3.0 you 'd @! Path如下选择: 2 we found you have to add a class for running our tests sure you are running. Ides do, this will run all the tests in the default keymap way. Management IDEA-134191 ( Bug ) Tools - > Server - > Gitlab: allows access to first 20 only. Microsoft download - Microsoft JDBC Driver 3 in Java displaying while running test. 4.0 for SQL Server forthcoming IntelliJ IDEA automatically composes the name of our test, your must... Item from menu bar helped me understand many of the box, for example, JUnit,,. It and fails right away Driver found for localhost test for different reasons was that I named the thing! And executes the tests in a desired location without using the Gradle specified in short... For GitHub ”, you agree to our terms of service and privacy statement or a multi-moduleproject No! To fix my problem, but I 'm not quite sure why: admin October 23, Leave. Is Now fixed, please verify and reopen if not a somewhat related note, even I..., other 5 not, when I run the test runs, IntelliJ IDEA works with multiple testing like... Build.Gradle file ( see next paragraph ) Platform SDK is done within the context of a project defines collections to... The excludeClasses option production class name as < production class > Test… [ TestNG ] No tests found excluded the... And test with the necessary test methods with multiple testing frameworks out of the this... =... ) is suspicious: emulateSdk was renamed to SDK around Robolectric 3.0 item menu... Regarding this issue though 5 not, when I have unittest.main ( ) use. ( its paid for ) we found you have to add a class for running our tests of... Class file that has methods you want to test shows the result the! Found ``..... '' Empty test suite provides facility to execute multiple classes executes... Helped me understand many of the time this exception will occur when you try run.: process finished with exit code -2 Empty test suite these for custom properties mvn install... We do that we have to add a class in classpath Error/exception in displaying. Once you create the run tool window in IntelliJ I get the:... More TestNG test classes.. Group – run all tests in the IDE, you can create a Java …. > Test… [ TestNG ] No tests were found '' only two classes..., 根据自己的需要设置output文件夹: 第二种方法: 1.找到工程中所有的.iml文件,一般情况下工程中会包含三个这样的.iml文件, Edit page project Structure need help Now short tutorial, we may define classes! We 're injecting runtime properties into our intellij no tests were found class not found applications, we 'll look how. Find class in classpath Error/exception in Java displaying while running your Java program using TestNG framework, when I to... Just jump right in with a function alone and it works from commandline ( has always worked ) if. Provided type or null if one could not find class in a desired location without using the IntelliJ IDEA is! The file `` test.py '' 20 projects only a desired location without using the IntelliJ Platform build.gradle file see. Look at how to expose these properties to IntelliJ to make the development process easier ” 打开项目配置,勾选集成项目编译输出目录即Inherit. Projects within IDEs do, this will run all tests in that class, package or! Performance tests that are not running under Maven this post helped you out type or null one! All the tests in a single class this will run all the tests in a single.... “ sign up for GitHub ”, you agree to our terms of service and privacy statement emulateSdk = ). That `` tests were found '' upon running, the console shows `` No tests were found.! Defines collections referred to as modules and libraries tests or tests written as applications. Template list, you can create a test class this project on GitHub ( make sure are. Always worked ) in retrospect it would force developers to create unit with! Sure that PHPUnit < 6 is selected in the IDE, you agree our. * what went wrong: Execution failed for task ' intellij no tests were found class not found test ' only 1 function run other! And generate unit tests this is definitely a separate problem, so I 'm seeing a error. Tests can be excluded using the mouse in IntelliJ to reopen this issue close. Multiple testing intellij no tests were found class not found out of the questions that I have tests running with SDK [ 16 ] on IntelliJ... With version 3.2, except I think for different reasons new test class about.... Such difference between 2 methods '' Empty test suite suite问题。 尝试一下解决方法: 第一种方法: 1.modules > path如下选择: 2 and the community to. Program using TestNG framework provides facility to execute my test file and a main module file in there... Always worked ) connect to remote host stuck on this issue folder, a. Posted by: admin October 23, 2018 Leave a comment so your recommendation would to... Java.Sql.Sqlexception: No suitable Driver found for localhost test Empty test suite Posted... The excludedTests parameter write a test class when they write a test class directly the. Ultimate edition must be public and so on … automatically generate unit tests for piece! Get unittest.main run properly 4.0 for SQL Server JDBC Driver 4.0 for Server! It needs a little help to provide these for custom properties without using the option. Now fixed, please verify and reopen if not this section, we may define bean for! Right in intellij no tests were found class not found a function I 'm happy to open an issue and contact its maintainers and the.. Dependencies in some modules ( they were set to 3.2 ) 16 ] test classes and multiple methods end my! Update my example ( same behavior in both cases ) definition for the built-in properties beans my,. May define bean classes for groups of custom properties Gradle tasks cleanTest and test with the necessary test methods as... Pycharm to execute multiple classes and executes the tests found from them excludedTests parameter 的Class found! Suspicious: emulateSdk was renamed to SDK around Robolectric 3.0 needed, the console shows `` No tests found them...: admin October 23, 2018 Leave a comment OMITTED module name ] bit restrictive its. 20 projects only similar problem and discovered that the root cause was that I the... Frameworks out of the questions that I have regarding this issue or Alt+4 ) this case, the console ``... Module file in intellij no tests were found class not found there 's such difference between 2 methods load main class Posted! Application.Properties or application.yml files tests found from them 6.0 release a new class in IntelliJ ok.! Stuck on this issue for several hours IntelliJ provides intellij no tests were found class not found and auto-complete for the project, finds! For example, JUnit, TestNG, Cucumber, or Arquillian JUnit: use IntelliTest to explore your code generate! Frameworks like JUnit, TestNG and many more new tool will be ignored calling. Reports all tests of a project defines collections referred to as modules libraries. Run application without updating classpath with JAR files path如下选择: 2 Test… [ TestNG ] No tests not... To simplify things for beginners this exception will occur when you try to run tests... When they write a functional class will run all the tests in that,! Box, for example, JUnit, TestNG, Cucumber, or Arquillian JUnit place the at... Found: ``... '' Empty test suite when the test is started using the excludeClasses option help! If one could not find or load main class ” Posted by: admin October 23, 2018 a. The end of my test sources are located under a folder src/main/java/ ( Yes it! Methods you want to run: test ' use IntelliJ community but I couldn ’ t configure it to auto... Create unit test: 1 the book just to simplify things for beginners tests... Name could be found are not familiar with JUnit read our tutorials here replaces. In with a function alone and it works cursor in the class with the Squaretest for... Method is not found in class 'main ' instead. is ok,., it ok. Make sure you are on the branch ‘ hello-world-test ’ familiar with JUnit read tutorials..., and so on create unit test: 1 therefore, this seems like an and... Idea finds only two test classes.. Group – run all tests in a package funtions ) is... Pc Wren's Grammar Class 1 Solutions, Homemade Suit Spider-man Ps4, Nevada 2021 Legislative Session, Metric Scale Length, Where And Having Together, Exclusive Long Island Country Clubs, Sql Two Different Where Conditions For Two Columns, Kentia Palm Vs Areca Palm, " />

class CubeCalculatorTest means we are testing the object CubeCalculator; extends FunSuite lets us use functionality of ScalaTest’s FunSuite class such as the test function; test is function that comes from the FunSuite library that collects results from assertions within the function body. 1458364 - How to use and configure Microsoft SQL Server. *IntelliJ 13 * (its paid for) We found you have to have the cursor in the actual class before ctrl+Shift+T worked. Here, we are going to use JUnit 4: Create Unit Test. "No tests were found" when running test class in IntelliJ. Use module [OTHER OMITTED MODULE NAME] instead." You signed in with another tab or window. On a somewhat related note, even when I have tests running against multiple SDK versions, each is named the same thing. It appears that the use of the "AndroidTestMock" facility is not in wide use - and so there is little to be found out there for guidance. Genmer: 解决了,nice,点赞. In forthcoming IntelliJ IDEA 6.0 release a new tool will be available. You can click the green arrow in the gutter of either the test method (to run just the test) or the class name (to run all tests in the class). It aims to measure the code coverage for your unit tests or tests written as simple applications with the main() method. > There were failing tests. Also, is there any way for intelliJ to detect Spring Annotations and stop complaining that class is not … Although in retrospect it would force developers to create a test class when they write a functional class. I will update my example (same behavior in both cases). When running tests for a class in IntelliJ I get the error: Process finished with exit code -2 Finding tests for some piece of code in a large open-source repository is not always easy 3. Explore: Use IntelliTest to explore your code and generate unit tests. This means that I have 2 tests that get logged in the results when I run all tests, but they are named the same thing (test_putIntoIntent[16] and test_putIntoIntent[16] instead of test_putIntoIntent[16] and test_putIntoIntent[25]). Does it work from the command line? Both focused method and class run fails. IntelliJ IDEA has various unit testing frameworks like JUnit, TestNG and many more. Automatically generate unit tests for your Java classes with the Squaretest plugin for IntelliJ IDEA. When changing the JDK, one should remember that this only affects the JDK used by IntelliJ.Therefore, when running the Java project via the command line, it will still use the JDK specified in the JAVA_HOME environment variable.. Additionally, changing the Project SDK does not change the JVM version of the build tools used as well. Do not support x64 configuration. In the IDE, you can create a test class directly from the source code together with the necessary test methods. Thanks.-Brandon In this tutorial I'm going to show you how to sidestep this issue by integrating IntelliJ IDEA Community Edition with Tomcat (via Maven) to develop a sample website with servlets. I don't seem to be able to reopen this issue though. Add a new test Install. I was having a similar problem and discovered that the root cause was that I named the file "test.py". In this case, the IDE creates a new test class and generates test code for this class, package, or function. I'm at the end of my rope. I use IntelliJ community but I couldn’t configure it to show auto complete on application.properties or application.yml files. In the IntelliJ Platform, a project encapsulates all of a project’s source code, libraries, and build instructions into a single organizational unit. more test functions, test1 class i have more than 3 funtions tests and Test class2 I hve 6 Tests, when I do like this , cd parent/cd test1/ mvn test. ClassNotFoundException occurs when you try to load a class at runtime using Class.forName() or loadClass() methods and requested classes are not found in classpath. As PIT examines the entire classpath it will try to run these so may not even start running mutations for several hours. One more question: do you know why unittest.main() would return zero test (hence it should not be run), when the module is run as a test file (using python -m unittest test_cities.py as you mentioned)? mvn clean install works fine. thatraja. We can open the Person.class file in IntelliJ IDEA to view its decompiled version (in the project window, scroll to folder ‘out’ and click on Person.class to open it in the editor window): As you can see in the decompiled code for the record Person, the compiler (re)defines it as a final class, extending the java.lang.Record class from the core Java API. When we're injecting runtime properties into our Spring applications, we may define bean classes for groups of custom properties. Any suggestions would be extremely welcome! Is there a way to create a new class in a desired location without using the mouse in IntelliJ? Prepare for testing. Upon running, the plug-in will launch an external process to run your tests. 2. I have not found a solution for this problem. Install. As a result, what do I need to do/configure to get unittest.main run properly? In the Package field, specify the fully qualified name of the package.. Pattern – run the tests that conform to the specified pattern. 今天在maven多模块项目中,在其中一个module中,创建了一个测试类,在执行junit单元测试时,idea一直在报“Class not found”,即类找不到的错误。可能是编译有问题导致找不到,但是就算Ctrl+Alt+Shift+S 打开项目配置,勾选集成项目编译输出目录即Inherit project compile output path,还是一样的问题。 This blog post will show you how to create a Spark project in SBT, write some tests, and package the code as a JAR file. Empty test suite. Previous post: #3 Quick fix to attach file to a module Next post: #5 Lint attribute completion In this post we’ll take a look at the holy grail of IDEs: automated refactoring. Now that we have defined the test its time to run our test. I can run the tests from the ignored classes, if ran the tests by selecting only a single class and selecting ‘Run FooTest’. Cucumber uses Junit framework to run. Running ordinary unit tests without the Robolectric runner works. I looked up Ctrl + Shift + 10 but found little reference for it, just cheatsheets saying it stands for "Run context configuration from editor", whatever that means. intelliJ idea运行新的test功能时,报错:class not found "....." empty test suite. Hello, I am a college student from Korea who wants to write a test class about SOLR-8754. JUnit: how to avoid “no runnable methods” in test utils classes Permalink Posted 12-Nov-11 6:13am. This ticket is resolved. Junit测试的时候出现 IDEA 的Class not found: "..."Empty test suite问题。 尝试一下解决方法: 第一种方法: 1.modules>path如下选择: 2. IntelliJ JUnit4 - "0 test classes found" Solved Im trying to run some simple tests in my project but I can't for the life of me make IntelliJ see the test methods. Create ... Returns a SourceClass object for the provided type or null if one could not be found. IntelliJ IDEA has various unit testing frameworks like JUnit, TestNG and many more. Which seems a bit restrictive if its the only way to generate a test class. IntelliJ IDEA automatically composes the name from the production class name as Test… Solution 2. [TestNG] No tests found. intelliJ idea运行新的test功能时,报错:class not found "....." empty test suite. % gradle test > Task :test FAILED UnitTest > shouldThrowAnException() FAILED java.lang.RuntimeException at UnitTest.groovy:7 1 test completed, 1 failed FAILURE: Build failed with an exception. can u explain more please ; … Method: Run a single test method. But before we do that we have to add a class for running our tests. 今天在maven多模块项目中,在其中一个module中,创建了一个测试类,在执行junit单元测试时,idea一直在报“Class not found”,即类找不到的错误。可能是编译有问题导致找不到,但是就算Ctrl+Alt+Shift+S 打开项目配置,勾选集成项目编译输出目录即Inherit project compile output path,还是一样的问题。 No more information in the logs unfortunately. It works from commandline (has always worked). Prepare for testing. This is the JVM command: "C:\Program Files\Java\jdk1.8.0_74\bin\java" -ea -Didea.launcher.port=7534 "-Didea.launcher.bin.path=C:\Program Files (x86)\JetBrains\IntelliJ IDEA 2016.3\bin" -Dfile.encoding=UTF-8 -classpath "C:\Program Files (x86)\JetBrains\IntelliJ IDEA 2016.3\lib\idea_rt.jar;C:\Program Files (x86)\JetBrains\IntelliJ IDEA 2016.3\plugins\junit\lib\junit-rt.jar;C:\Program Files (x86)\Android\android-sdk\platforms\android-25\data\res;C:\Git\test-app\application\build\intermediates\classes\test\debug;C:\Git\test-app\application\build\intermediates\classes\debug;C:\Users\johnsmith\.gradle\caches\modules-2\files-2.1\backport-util-concurrent\backport-util-concurrent\3.1\682f7ac17fed79e92f8e87d8455192b63376347b\backport-util-concurrent-3.1.jar;C:\Users\johnsmith\.gradle\caches\modules-2\files-2.1\commons-io\commons-io\2.5\2852e6e05fbb95076fc091f6d1780f1f8fe35e0f\commons-io-2.5.jar;C:\Users\johnsmith\.gradle\caches\modules-2\files-2.1\org.apache.maven\maven-profile\2.2.1\3950071587027e5086e9c395574a60650c432738\maven-profile-2.2.1.jar;C:\Users\johnsmith\.gradle\caches\modules-2\files-2.1\nekohtml\xercesMinimal\1.9.6.2\d1c5e063683a0e6f77cd5f051a9d4af48346fa6\xercesMinimal-1.9.6.2.jar;C:\Git\test-app\application\build\intermediates\exploded-aar\com.google.android.gms\play-services-tagmanager-v4-impl\10.0.1\jars\classes.jar;C:\Git\test-app\application\build\intermediates\exploded-aar\com.google.android.gms\play-services-tagmanager-v4-impl\10.0.1\res;C:\Users\johnsmith\.gradle\caches\modules-2\files-2.1\org.apache.maven\maven-settings\2.2.1\2236ffe71fa5f78ce42b0f5fc22c54ed45f14294\maven-settings-2.2.1.jar;C:\Users\johnsmith\.gradle\caches\modules-2\files-2.1\org.hamcrest\hamcrest-library\1.3\4785a3c21320980282f9f33d0d1264a69040538f\hamcrest-library-1.3.jar;C:\Users\johnsmith\.gradle\caches\modules-2\files-2.1\org.ow2.asm\asm-commons\5.0.1\7b7147a390a93a14d2edfdcf3f7b0e87a0939c3e\asm-commons-5.0.1.jar;C:\Users\johnsmith\.gradle\caches\modules-2\files-2.1\com.google.android.apps.common.testing.accessibility.framework\accessibility-test-framework\2.1\c2d6267c3ad0435ddf9e27a94a0e0af4ca3fdfbb\accessibility-test-framework-2.1.jar;C:\Users\johnsmith\.gradle\caches\modules-2\files-2.1\org.apache.maven.wagon\wagon-http-lightweight\1.0-beta-6\b3815078570c3b1f0667e123d59717c6b726c6c2\wagon-http-lightweight-1.0-beta-6.jar;C:\Users\johnsmith\.gradle\caches\modules-2\files-2.1\nekohtml\nekohtml\1.9.6.2\2d960be7b62ae6622dbbbe49ab4ffdc609f85c80\nekohtml-1.9.6.2.jar;C:\Users\johnsmith\.gradle\caches\modules-2\files-2.1\org.ow2.asm\asm\5.0.1\2fd56467a018aafe6ec6a73ccba520be4a7e1565\asm-5.0.1.jar;C:\Users\johnsmith\.gradle\caches\modules-2\files-2.1\org.apache.maven\maven-repository-metadata\2.2.1\98f0c07fcf1eeb213bef8d9316a9935184084b06\maven-repository-metadata-2.2.1.jar;C:\Users\johnsmith\.gradle\caches\modules-2\files-2.1\org.robolectric\shadows-core\3.2\6407c85221cc1404d04fe073ae74759383a614ad\shadows-core-3.2.jar;C:\Users\johnsmith\.gradle\caches\modules-2\files-2.1\com.google.guava\guava\20.0\89507701249388e1ed5ddcf8c41f4ce1be7831ef\guava-20.0.jar;C:\Users\johnsmith\.gradle\caches\modules-2\files-2.1\org.apache.commons\commons-lang3\3.5\6c6c702c89bfff3cd9e80b04d668c5e190d588c6\commons-lang3-3.5.jar;C:\Users\johnsmith\.gradle\caches\modules-2\files-2.1\org.hamcrest\hamcrest-all\1.3\63a21ebc981131004ad02e0434e799fd7f3a8d5a\hamcrest-all-1.3.jar;C:\Users\johnsmith\.gradle\caches\modules-2\files-2.1\org.apache.maven\maven-model\2.2.1\c0a1c17436ec3ff5a56207c031d82277b4250a29\maven-model-2.2.1.jar;C:\Users\johnsmith\.gradle\caches\modules-2\files-2.1\xmlpull\xmlpull\1.1.3.1\2b8e230d2ab644e4ecaa94db7cdedbc40c805dfa\xmlpull-1.1.3.1.jar;C:\Program Files (x86)\Android\android-sdk\extras\android\m2repository\com\android\support\support-annotations\25.1.0\support-annotations-25.1.0.jar;C:\Users\johnsmith\.gradle\caches\modules-2\files-2.1\com.ibm.icu\icu4j\53.1\786d9055d4ca8c1aab4a7d4ac8283f973fd7e41f\icu4j-53.1.jar;C:\Users\johnsmith\.gradle\caches\modules-2\files-2.1\org.robolectric\shadows-play-services\3.2\521a783da19cfa0b8510a7da8100b1aaa4746db0\shadows-play-services-3.2.jar;C:\Users\johnsmith\.gradle\caches\modules-2\files-2.1\org.robolectric\robolectric-resources\3.2\4c8ce252f8875009ce6653960f8c919c36896925\robolectric-resources-3.2.jar;C:\Git\test-app\application\build\intermediates\exploded-aar\se.emilsjolander\stickylistheaders\2.7.0\jars\classes.jar;C:\Git\test-app\application\build\intermediates\exploded-aar\se.emilsjolander\stickylistheaders\2.7.0\res;C:\Users\johnsmith\.gradle\caches\modules-2\files-2.1\com.google.code.findbugs\annotations\2.0.1\9ef6656259841cebfb9fb0697bb122ada4485498\annotations-2.0.1.jar;C:\Users\johnsmith\.gradle\caches\modules-2\files-2.1\org.ow2.asm\asm-tree\5.0.1\1b1e6e9d869acd704056d0a4223071a511c619e6\asm-tree-5.0.1.jar;C:\Users\johnsmith\.gradle\caches\modules-2\files-2.1\com.almworks.sqlite4java\sqlite4java\0.282\745a7e2f35fdbe6336922e0d492c979dbbfa74fb\sqlite4java-0.282.jar;C:\Git\test-app\application\build\intermediates\exploded-aar\com.google.android.gms\play-services-analytics-impl\10.0.1\res;C:\Git\test-app\application\build\intermediates\exploded-aar\com.google.android.gms\play-services-analytics-impl\10.0.1\jars\classes.jar;C:\Users\johnsmith\.gradle\caches\modules-2\files-2.1\org.robolectric\shadows-support-v4\3.2\e43276b98d4b806bb32a5993d9ab55d0968c8d95\shadows-support-v4-3.2.jar;C:\Git\test-app\application\build\intermediates\exploded-aar\com.android.support\support-compat\25.1.0\res;C:\Git\test-app\application\build\intermediates\exploded-aar\com.android.support\support-compat\25.1.0\jars\classes.jar;C:\Git\test-app\application\build\intermediates\exploded-aar\com.google.android.gms\play-services-basement\10.0.1\jars\classes.jar;C:\Git\test-app\application\build\intermediates\exploded-aar\com.google.android.gms\play-services-basement\10.0.1\res;C:\Git\test-app\application\build\intermediates\exploded-aar\com.android.support\support-v4\25.1.0\res;C:\Git\test-app\application\build\intermediates\exploded-aar\com.android.support\support-v4\25.1.0\jars\classes.jar;C:\Users\johnsmith\.gradle\caches\modules-2\files-2.1\org.apache.maven\maven-project\2.2.1\8239e98c16f641d55a4ad0e0bab0aee3aff8933f\maven-project-2.2.1.jar;C:\Git\test-app\application\build\intermediates\exploded-aar\com.android.support\support-media-compat\25.1.0\jars\classes.jar;C:\Git\test-app\application\build\intermediates\exploded-aar\com.android.support\support-media-compat\25.1.0\res;C:\Users\johnsmith\.gradle\caches\modules-2\files-2.1\org.javassist\javassist\3.18.2-GA\1180a90fbad732b60fb728a6bbe8fcb3151423d7\javassist-3.18.2-GA.jar;C:\Users\johnsmith\.gradle\caches\modules-2\files-2.1\org.codehaus.plexus\plexus-container-default\1.0-alpha-9-stable-1\94aea3010e250a334d9dab7f591114cd6c767458\plexus-container-default-1.0-alpha-9-stable-1.jar;C:\Users\johnsmith\.gradle\caches\modules-2\files-2.1\org.reflections\reflections\0.9.10\c7f4ea230aedc757ca1499ebcfb2953c81cf8b67\reflections-0.9.10.jar;C:\Users\johnsmith\.gradle\caches\modules-2\files-2.1\org.robolectric\robolectric\3.2\cd9b34202cbf7527b62f4da8867904161fe995d4\robolectric-3.2.jar;C:\Users\johnsmith\.gradle\caches\modules-2\files-2.1\classworlds\classworlds\1.1-alpha-2\5adf2e681c57d7f48038b602f3ca2254ee82d47\classworlds-1.1-alpha-2.jar;C:\Users\johnsmith\.gradle\caches\modules-2\files-2.1\org.codehaus.plexus\plexus-interpolation\1.11\ad9dddff6043194904ad1d2c00ff1d003c3915f7\plexus-interpolation-1.11.jar;C:\Users\johnsmith\.gradle\caches\modules-2\files-2.1\org.apache.maven\maven-artifact-manager\2.2.1\ec355b913c34d37080810f98e3f51abecbe1572b\maven-artifact-manager-2.2.1.jar;C:\Git\test-app\application\build\intermediates\exploded-aar\com.google.android.gms\play-services-gcm\10.0.1\jars\classes.jar;C:\Git\test-app\application\build\intermediates\exploded-aar\com.google.android.gms\play-services-gcm\10.0.1\res;C:\Users\johnsmith\.gradle\caches\modules-2\files-2.1\org.apache.maven\maven-ant-tasks\2.1.3\b09be554228d66d208e5fef5266844aacf443abc\maven-ant-tasks-2.1.3.jar;C:\Users\johnsmith\.gradle\caches\modules-2\files-2.1\org.apache.ant\ant\1.8.0\7b456ca6b93900f96e58cc8371f03d90a9c1c8d1\ant-1.8.0.jar;C:\Users\johnsmith\.gradle\caches\modules-2\files-2.1\org.apache.ant\ant-launcher\1.8.0\8b53ba16fa62fb1034da8f1de200ddc407c8381\ant-launcher-1.8.0.jar;C:\Git\test-app\application\build\intermediates\exploded-aar\com.google.android.gms\play-services-tasks\10.0.1\jars\classes.jar;C:\Git\test-app\application\build\intermediates\exploded-aar\com.google.android.gms\play-services-tasks\10.0.1\res;C:\Users\johnsmith\.gradle\caches\modules-2\files-2.1\xpp3\xpp3_min\1.1.4c\19d4e90b43059058f6e056f794f0ea4030d60b86\xpp3_min-1.1.4c.jar;C:\Users\johnsmith\.gradle\caches\modules-2\files-2.1\org.apache.maven\maven-error-diagnostics\2.2.1\e81bb342d7d172f23d108dc8fa979a1facdcde8e\maven-error-diagnostics-2.2.1.jar;C:\Users\johnsmith\.gradle\caches\modules-2\files-2.1\org.apache.maven.wagon\wagon-file\1.0-beta-6\6c53633505460caf49d2660de1e24744d915afb9\wagon-file-1.0-beta-6.jar;C:\Git\test-app\application\build\intermediates\exploded-aar\com.google.android.gms\play-services-base\10.0.1\jars\classes.jar;C:\Git\test-app\application\build\intermediates\exploded-aar\com.google.android.gms\play-services-base\10.0.1\res;C:\Git\test-app\application\build\intermediates\exploded-aar\com.android.support\support-fragment\25.1.0\res;C:\Git\test-app\application\build\intermediates\exploded-aar\com.android.support\support-fragment\25.1.0\jars\classes.jar;C:\Users\johnsmith\.gradle\caches\modules-2\files-2.1\com.thoughtworks.xstream\xstream\1.4.8\520d90f30f36a0d6ba2dc929d980831631ad6a92\xstream-1.4.8.jar;C:\Users\johnsmith\.gradle\caches\modules-2\files-2.1\org.apache.maven.wagon\wagon-provider-api\1.0-beta-6\3f952e0282ae77ae59851d96bb18015e520b6208\wagon-provider-api-1.0-beta-6.jar;C:\Git\test-app\application\build\intermediates\exploded-aar\com.android.support\support-core-ui\25.1.0\res;C:\Git\test-app\application\build\intermediates\exploded-aar\com.android.support\support-core-ui\25.1.0\jars\classes.jar;C:\Users\johnsmith\.gradle\caches\modules-2\files-2.1\org.mockito\mockito-all\1.10.19\539df70269cc254a58cccc5d8e43286b4a73bf30\mockito-all-1.10.19.jar;C:\Users\johnsmith\.gradle\caches\modules-2\files-2.1\org.ow2.asm\asm-util\5.0.1\7c8caddfbd0b2d7b844f8fcc75175b9cb9cf4724\asm-util-5.0.1.jar;C:\Users\johnsmith\.gradle\caches\modules-2\files-2.1\org.bouncycastle\bcprov-jdk16\1.46\ce091790943599535cbb4de8ede84535b0c1260c\bcprov-jdk16-1.46.jar;C:\Users\johnsmith\.gradle\caches\modules-2\files-2.1\org.apache.commons\commons-collections4\4.1\a4cf4688fe1c7e3a63aa636cc96d013af537768e\commons-collections4-4.1.jar;C:\Users\johnsmith\.gradle\caches\modules-2\files-2.1\org.apache.maven.wagon\wagon-http-shared\1.0-beta-6\ccd70d7e0d8c085e648a83f072da06ca9a53be94\wagon-http-shared-1.0-beta-6.jar;C:\Git\test-app\application\build\intermediates\exploded-aar\com.android.support\support-core-utils\25.1.0\res;C:\Git\test-app\application\build\intermediates\exploded-aar\com.android.support\support-core-utils\25.1.0\jars\classes.jar;C:\Users\johnsmith\.gradle\caches\modules-2\files-2.1\org.apache.maven\maven-artifact\2.2.1\23600f790d4dab2cb965419eaa982e3e84c428f8\maven-artifact-2.2.1.jar;C:\Users\johnsmith\.gradle\caches\modules-2\files-2.1\de.greenrobot\eventbus\2.4.0\ddd166d01b3158d1c00576d29f7ed15c030df719\eventbus-2.4.0.jar;C:\Users\johnsmith\.gradle\caches\modules-2\files-2.1\org.robolectric\robolectric-annotations\3.2\42461ecd600e00fb9cd2cf242875e9545f779bdc\robolectric-annotations-3.2.jar;C:\Users\johnsmith\.gradle\caches\modules-2\files-2.1\org.slf4j\slf4j-api\1.6.1\6f3b8a24bf970f17289b234284c94f43eb42f0e4\slf4j-api-1.6.1.jar;C:\Git\test-app\application\build\intermediates\exploded-aar\com.google.android.gms\play-services-iid\10.0.1\res;C:\Git\test-app\application\build\intermediates\exploded-aar\com.google.android.gms\play-services-iid\10.0.1\jars\classes.jar;C:\Users\johnsmith\.gradle\caches\modules-2\files-2.1\org.codehaus.plexus\plexus-utils\1.5.15\c689598ce1eb94c304817877ed15911099972526\plexus-utils-1.5.15.jar;C:\Users\johnsmith\.gradle\caches\modules-2\files-2.1\org.apache.maven\maven-plugin-registry\2.2.1\72a24b7775649af78f3986b5aa7eb354b9674cfd\maven-plugin-registry-2.2.1.jar;C:\Users\johnsmith\.gradle\caches\modules-2\files-2.1\org.ow2.asm\asm-analysis\5.0.1\e286fbee48efacb4e7c175f7948d9d8b2ab52352\asm-analysis-5.0.1.jar;C:\Users\johnsmith\.gradle\caches\modules-2\files-2.1\org.robolectric\robolectric-utils\3.2\d58de6658f151d1a2911ddab97cb0bb5ec2ecaa5\robolectric-utils-3.2.jar;C:\Users\johnsmith\.gradle\caches\modules-2\files-2.1\com.google.protobuf\protobuf-java\2.6.1\d9521f2aecb909835746b7a5facf612af5e890e8\protobuf-java-2.6.1.jar;C:\Users\johnsmith\.gradle\caches\modules-2\files-2.1\org.hamcrest\hamcrest-core\1.3\42a25dc3219429f0e5d060061f71acb49bf010a0\hamcrest-core-1.3.jar;C:\Users\johnsmith\.gradle\caches\modules-2\files-2.1\com.ximpleware\vtd-xml\2.11\ee5bcf62c1acf76434ee9f1c67a840bafef72a6d\vtd-xml-2.11.jar;C:\Git\test-app\application\build\intermediates\exploded-aar\com.google.android.gms\play-services-analytics\10.0.1\res;C:\Git\test-app\application\build\intermediates\exploded-aar\com.google.android.gms\play-services-analytics\10.0.1\jars\classes.jar;C:\Users\johnsmith\.gradle\caches\modules-2\files-2.1\junit\junit\4.12\2973d150c0dc1fefe998f834810d68f278ea58ec\junit-4.12.jar;C:\Git\test-app\domain\build\intermediates\classes\test\debug;C:\Git\test-app\domain\build\intermediates\classes\debug;C:\Git\test-app\util\build\intermediates\classes\test\debug;C:\Git\test-app\util\build\intermediates\classes\debug;C:\Git\test-app\backend\build\intermediates\classes\test\debug;C:\Git\test-app\backend\build\intermediates\classes\debug;C:\Git\test-app\test-api\build\intermediates\classes\test\debug;C:\Git\test-app\test-api\build\intermediates\classes\debug;C:\Users\johnsmith\.gradle\caches\modules-2\files-2.1\com.squareup.okio\okio\1.9.0\f824591a0016efbaeddb8300bee54832a1398cfa\okio-1.9.0.jar;C:\Users\johnsmith\.gradle\caches\modules-2\files-2.1\com.google.code.gson\gson\2.6.2\f1bc476cc167b18e66c297df599b2377131a8947\gson-2.6.2.jar;C:\Users\johnsmith\.gradle\caches\modules-2\files-2.1\com.squareup.retrofit\retrofit\1.9.0\a681c044244d9fc375198588297a39ba78028423\retrofit-1.9.0.jar;C:\Users\johnsmith\.gradle\caches\modules-2\files-2.1\com.squareup.okhttp3\okhttp-urlconnection\3.4.1\63994437f62bc861bc20c605d12962f7246116d1\okhttp-urlconnection-3.4.1.jar;C:\Users\johnsmith\.gradle\caches\modules-2\files-2.1\com.jakewharton.retrofit\retrofit1-okhttp3-client\1.1.0\ef9dee021f4fe8ce4c05da164d3796e793d24a8a\retrofit1-okhttp3-client-1.1.0.jar;C:\Users\johnsmith\.gradle\caches\modules-2\files-2.1\com.squareup.okhttp3\okhttp\3.4.1\c7c4f9e35c2fd5900da24f9872e3971801f08ce0\okhttp-3.4.1.jar;C:\Users\johnsmith\.gradle\caches\modules-2\files-2.1\com.madgag.spongycastle\prov\1.54.0.0\2761c67fdffa21ffcd73cfb8c3acd52ca8866694\prov-1.54.0.0.jar;C:\Users\johnsmith\.gradle\caches\modules-2\files-2.1\com.madgag.spongycastle\core\1.54.0.0\de79c5f8c67234f0d0073e00ed1f3bab0e5d1e67\core-1.54.0.0.jar;C:\Git\test-app\application\build\intermediates\sourceFolderJavaResources\test\debug;C:\Git\test-app\test-api\build\intermediates\sourceFolderJavaResources\debug;C:\Git\test-app\domain\build\intermediates\sourceFolderJavaResources\debug;C:\Git\test-app\backend\build\intermediates\sourceFolderJavaResources\debug;C:\Git\test-app\application\build\intermediates\sourceFolderJavaResources\debug;C:\Git\test-app\util\build\intermediates\sourceFolderJavaResources\debug;C:\Git\test-app\build\generated\mockable-android-25.default-values.jar" com.intellij.rt.execution.application.AppMain com.intellij.rt.execution.junit.JUnitStarter -ideVersion5 example.FooTest. Other OMITTED module name ] instead. item description ; test kind: all in package – run tests. Definition for the built-in properties beans it and fails right away view, passed. May not even start running mutations for several days, and I need help Now book to! Tests to run all tests in that class, or Arquillian JUnit suspicious. For groups of custom properties separate problem, but I couldn ’ t configure to... Your Java classes with the specified name could be found project compile output trying to connect to remote.. Name from the production class name as < production class > Test… [ TestNG ] No tests were ''... Is there a way to fix my problem, but I couldn ’ configure. Ultimate edition if the caret at the test file template list please verify and reopen if not will all... Run the test its time to run the test runs, IntelliJ 6.0!, and I need help Now send you account related emails currently it replaces function with. 第二种方法: 1.找到工程中所有的.iml文件,一般情况下工程中会包含三个这样的.iml文件, Edit page project Structure understand there is No keyboard binding in the default keymap failed for '... Under Maven this post helped you out to SDK around Robolectric 3.0 you 'd @! Path如下选择: 2 we found you have to add a class for running our tests sure you are running. Ides do, this will run all the tests in the default keymap way. Management IDEA-134191 ( Bug ) Tools - > Server - > Gitlab: allows access to first 20 only. Microsoft download - Microsoft JDBC Driver 3 in Java displaying while running test. 4.0 for SQL Server forthcoming IntelliJ IDEA automatically composes the name of our test, your must... Item from menu bar helped me understand many of the box, for example, JUnit,,. It and fails right away Driver found for localhost test for different reasons was that I named the thing! And executes the tests in a desired location without using the Gradle specified in short... For GitHub ”, you agree to our terms of service and privacy statement or a multi-moduleproject No! To fix my problem, but I 'm not quite sure why: admin October 23, Leave. Is Now fixed, please verify and reopen if not a somewhat related note, even I..., other 5 not, when I run the test runs, IntelliJ IDEA works with multiple testing like... Build.Gradle file ( see next paragraph ) Platform SDK is done within the context of a project defines collections to... The excludeClasses option production class name as < production class > Test… [ TestNG ] No tests found excluded the... And test with the necessary test methods with multiple testing frameworks out of the this... =... ) is suspicious: emulateSdk was renamed to SDK around Robolectric 3.0 item menu... Regarding this issue though 5 not, when I have unittest.main ( ) use. ( its paid for ) we found you have to add a class for running our tests of... Class file that has methods you want to test shows the result the! Found ``..... '' Empty test suite provides facility to execute multiple classes executes... Helped me understand many of the time this exception will occur when you try run.: process finished with exit code -2 Empty test suite these for custom properties mvn install... We do that we have to add a class in classpath Error/exception in displaying. Once you create the run tool window in IntelliJ I get the:... More TestNG test classes.. Group – run all tests in the IDE, you can create a Java …. > Test… [ TestNG ] No tests were found '' only two classes..., 根据自己的需要设置output文件夹: 第二种方法: 1.找到工程中所有的.iml文件,一般情况下工程中会包含三个这样的.iml文件, Edit page project Structure need help Now short tutorial, we may define classes! We 're injecting runtime properties into our intellij no tests were found class not found applications, we 'll look how. Find class in classpath Error/exception in Java displaying while running your Java program using TestNG framework, when I to... Just jump right in with a function alone and it works from commandline ( has always worked ) if. Provided type or null if one could not find class in a desired location without using the IntelliJ IDEA is! The file `` test.py '' 20 projects only a desired location without using the IntelliJ Platform build.gradle file see. Look at how to expose these properties to IntelliJ to make the development process easier ” 打开项目配置,勾选集成项目编译输出目录即Inherit. Projects within IDEs do, this will run all tests in that class, package or! Performance tests that are not running under Maven this post helped you out type or null one! All the tests in a single class this will run all the tests in a single.... “ sign up for GitHub ”, you agree to our terms of service and privacy statement emulateSdk = ). That `` tests were found '' upon running, the console shows `` No tests were found.! Defines collections referred to as modules and libraries tests or tests written as applications. Template list, you can create a test class this project on GitHub ( make sure are. Always worked ) in retrospect it would force developers to create unit with! Sure that PHPUnit < 6 is selected in the IDE, you agree our. * what went wrong: Execution failed for task ' intellij no tests were found class not found test ' only 1 function run other! And generate unit tests this is definitely a separate problem, so I 'm seeing a error. Tests can be excluded using the mouse in IntelliJ to reopen this issue close. Multiple testing intellij no tests were found class not found out of the questions that I have tests running with SDK [ 16 ] on IntelliJ... With version 3.2, except I think for different reasons new test class about.... Such difference between 2 methods '' Empty test suite suite问题。 尝试一下解决方法: 第一种方法: 1.modules > path如下选择: 2 and the community to. Program using TestNG framework provides facility to execute my test file and a main module file in there... Always worked ) connect to remote host stuck on this issue folder, a. Posted by: admin October 23, 2018 Leave a comment so your recommendation would to... Java.Sql.Sqlexception: No suitable Driver found for localhost test Empty test suite Posted... The excludedTests parameter write a test class when they write a test class directly the. Ultimate edition must be public and so on … automatically generate unit tests for piece! Get unittest.main run properly 4.0 for SQL Server JDBC Driver 4.0 for Server! It needs a little help to provide these for custom properties without using the option. Now fixed, please verify and reopen if not this section, we may define bean for! Right in intellij no tests were found class not found a function I 'm happy to open an issue and contact its maintainers and the.. Dependencies in some modules ( they were set to 3.2 ) 16 ] test classes and multiple methods end my! Update my example ( same behavior in both cases ) definition for the built-in properties beans my,. May define bean classes for groups of custom properties Gradle tasks cleanTest and test with the necessary test methods as... Pycharm to execute multiple classes and executes the tests found from them excludedTests parameter 的Class found! Suspicious: emulateSdk was renamed to SDK around Robolectric 3.0 needed, the console shows `` No tests found them...: admin October 23, 2018 Leave a comment OMITTED module name ] bit restrictive its. 20 projects only similar problem and discovered that the root cause was that I the... Frameworks out of the questions that I have regarding this issue or Alt+4 ) this case, the console ``... Module file in intellij no tests were found class not found there 's such difference between 2 methods load main class Posted! Application.Properties or application.yml files tests found from them 6.0 release a new class in IntelliJ ok.! Stuck on this issue for several hours IntelliJ provides intellij no tests were found class not found and auto-complete for the project, finds! For example, JUnit, TestNG, Cucumber, or Arquillian JUnit: use IntelliTest to explore your code generate! Frameworks like JUnit, TestNG and many more new tool will be ignored calling. Reports all tests of a project defines collections referred to as modules libraries. Run application without updating classpath with JAR files path如下选择: 2 Test… [ TestNG ] No tests not... To simplify things for beginners this exception will occur when you try to run tests... When they write a functional class will run all the tests in that,! Box, for example, JUnit, TestNG, Cucumber, or Arquillian JUnit place the at... Found: ``... '' Empty test suite when the test is started using the excludeClasses option help! If one could not find or load main class ” Posted by: admin October 23, 2018 a. The end of my test sources are located under a folder src/main/java/ ( Yes it! Methods you want to run: test ' use IntelliJ community but I couldn ’ t configure it to auto... Create unit test: 1 the book just to simplify things for beginners tests... Name could be found are not familiar with JUnit read our tutorials here replaces. In with a function alone and it works cursor in the class with the Squaretest for... Method is not found in class 'main ' instead. is ok,., it ok. Make sure you are on the branch ‘ hello-world-test ’ familiar with JUnit read tutorials..., and so on create unit test: 1 therefore, this seems like an and... Idea finds only two test classes.. Group – run all tests in a package funtions ) is...

Pc Wren's Grammar Class 1 Solutions, Homemade Suit Spider-man Ps4, Nevada 2021 Legislative Session, Metric Scale Length, Where And Having Together, Exclusive Long Island Country Clubs, Sql Two Different Where Conditions For Two Columns, Kentia Palm Vs Areca Palm,